{"text_format":"1","workbook":"xlsx","n_sheets":13,"sheets":["Client Demographics","ADLs","Medical Needs","Nursing Assessment Indicators","Nighttime Needs","Social and Behavioral Needs","Enhanced or Exceptional","Support Needs Summary","Summary of In-Home Hours","2-1 Review and Approval","Raw Scoring","New Scoring","Control"],"not_rendered":{"charts":0,"images":24,"macros":1,"external_links":0,"defined_names":228,"comments":1,"pivot_tables":0},"unopened":[],"bounds":{"document_bytes":16777216,"sheet_cells":100000,"rows_first":2000,"rows_last":500,"rows_between":2000,"halvings":0,"cell_chars":16384,"cell_head_chars":4096},"cells_cut":0,"cells_raw":0,"read":"whole","date_system":"1900"}

{"sheet":"Client Demographics","index":0,"n_rows":24,"n_cols":17,"rows_kept":24,"cut":false,"hidden":false,"merged":[[6,14,6,16],[12,13,12,15],[13,13,13,15],[11,13,11,15],[7,14,7,16],[8,14,8,16],[6,11,6,13],[7,10,7,12],[10,13,10,16],[9,8,9,10],[9,11,9,16],[4,0,4,2],[2,3,2,8],[4,9,4,10],[4,11,4,16],[4,3,4,8],[3,3,3,8],[2,11,2,12],[2,9,2,10],[3,9,3,10],[3,11,3,12],[0,0,0,16],[3,13,3,14],[2,0,2,2],[3,0,3,2],[3,15,3,16],[1,13,1,16],[1,0,1,12],[16,13,16,15],[17,0,17,2],[17,3,17,4],[16,8,16,12],[17,8,17,9],[17,12,17,13],[16,1,16,7],[7,0,7,3],[11,1,11,7],[17,5,17,7],[15,1,15,7],[13,1,13,7],[10,0,10,7],[14,1,14,7],[8,0,9,3],[8,4,9,7],[15,13,15,15],[11,8,11,12],[12,8,12,12],[13,8,13,12],[14,13,14,15],[5,0,5,5],[5,6,5,8],[23,0,23,2],[5,11,5,12],[10,8,10,12],[8,10,8,12],[15,8,15,12],[14,8,14,12],[6,3,6,4],[12,1,12,7],[8,8,8,9],[6,5,6,10],[5,9,5,10],[6,0,6,2],[7,8,7,9],[7,4,7,7]]}
["Child In-Home Support Needs Assessment"]
["WARNING: Macros are currently disabled.  If this message persists after workbook initialization, please close this file, then reopen it and select either [Enable Macros] or [Enable Content], whichever option is displayed.\n\n* If you believe you have already enabled Macros/Content then:\n   1. First, select the Ribbon's File tab and, if you see a security warning, select the large [Enable Content v] shield button, \n        then \"Enable All Content\".\n   2. If you don't find a security warning then select the [Fix Me] button to the right, on this sheet.",null,null,null,null,null,null,null,null,null,null,null,null,{"$f":"IF(AND(ClientDOB<AssessmentDate,IFERROR(DATEDIF(ClientDOB,EffectiveAssmtDate,\"YD\") < 60,FALSE)),\"(\" & AssmtGracePeriod & \"-day grace period is in effect)\",\"\")","v":""}]
["(Legal Name) \nName of Individual",null,null,null,null,null,null,null,null,"Date of Birth",null,null,null,"Assess.\nAge",{"$f":"IF(OR(L3=\"\",AssessmentDate=\"\",L3>=AssessmentDate),\n       \"\",\n       IF(DATEDIF(L3,AssessmentDate,\"Y\")=0,\n            DATEDIF(L3,AssessmentDate,\"YM\") & \" Month\" & IF(DATEDIF(L3,AssessmentDate,\"YM\")=1,\"\",\"s\"),\n            IF(DATEDIF(L3,AssessmentDate,\"Y\")=1,\n                 DATEDIF(L3,AssessmentDate,\"M\") & \" Months\",\n                 DATEDIF(L3,AssessmentDate,\"Y\"))))","v":""},"Adjust.\nAge",{"$f":"IF(OR(L3=\"\",EffectiveAssmtDate=\"\",L3>=AssessmentDate),\n       \"\",\n       IF(DATEDIF(L3,EffectiveAssmtDate,\"Y\")=0,\n            DATEDIF(L3,EffectiveAssmtDate,\"YM\") & \" Month\" & IF(DATEDIF(L3,EffectiveAssmtDate,\"YM\")=1,\"\",\"s\"),\n            IF(DATEDIF(L3,EffectiveAssmtDate,\"Y\")=1,\n                 DATEDIF(L3,EffectiveAssmtDate,\"M\") & \" Months\",\n                 DATEDIF(L3,EffectiveAssmtDate,\"Y\"))))","v":""}]
["Prime #",null,null,null,null,null,null,null,null,"Height",null,null,null,"Weight"]
["Service Setting",null,null,"(Select)",null,null,null,null,null,"Service Element",null,"(Select)"]
["Did the individual participate in the Assessment?",null,null,null,null,null,"(Select)",null,null,"Gender",null,"(Select)"]
{"$rows_left_out":19}
{"sheet":"ADLs","index":1,"n_rows":140,"n_cols":14,"rows_kept":140,"cut":false,"hidden":false,"merged":[[139,0,139,1],[140,0,140,1],[98,0,98,1],[99,0,99,1],[106,0,106,1],[107,0,107,1],[110,0,110,1],[111,0,111,1],[117,0,117,1],[118,0,118,1],[132,0,132,1],[133,0,133,1],[121,0,121,1],[122,0,122,1],[128,0,128,1],[129,0,129,1],[46,0,46,1],[47,0,47,1],[95,0,95,1],[74,0,74,1],[75,0,75,1],[82,0,82,1],[83,0,83,1],[50,0,50,1],[52,0,52,1],[58,0,58,1],[59,0,59,1],[62,0,62,1],[94,0,94,1],[64,0,64,1],[70,0,70,1],[71,0,71,1],[86,0,86,1],[87,0,87,1],[14,0,14,1],[15,0,15,1],[2,0,2,1],[3,0,3,1],[10,0,10,1],[11,0,11,1],[22,0,22,1],[23,0,23,1],[37,0,37,1],[38,0,38,1],[26,0,26,1],[27,0,27,1],[33,0,33,1],[34,0,34,1]]}
[null,null,null,"Support Need","2:1 Review?","Documentation Needed","Selection\nValue","En/Dis-able\nOther","Disabled\nBy","Group #","Group","Name","Current\nState","Mismatch\nTrace"]
[null,"Rating selections must be applied in accordance with the “ANA/CNA Manual version 3”, available at http://www.dhs.state.or.us/spd/tools/dd/cm/"]
["AMBULATION / MOBILITY IN THE HOME AND COMMUNITY"]
[{"$f":"IF(INDEX('Raw Scoring'!D1:D13,MAX(J4:J10)+1)=\"Yes\",\"2:1 Review\",\"\")","v":""}]
[null,"This section assesses the child's physical ability to move around in familiar places with or without mechanical aids.\nChoose the option that most accurately reflects the supports required by the child, which are not due to behaviors.\nCheck an option only if the support needed is due to the child's disability.\n\n"]
[]
{"$rows_left_out":135}
{"sheet":"Medical Needs","index":2,"n_rows":160,"n_cols":14,"rows_kept":160,"cut":false,"hidden":false,"merged":[[70,0,70,1],[80,0,80,1],[81,0,81,1],[14,0,14,1],[20,0,20,1],[21,0,21,1],[46,0,46,1],[47,0,47,1],[24,0,24,1],[25,0,25,1],[42,0,42,1],[43,0,43,1],[59,0,59,1],[65,0,65,1],[66,0,66,1],[69,0,69,1],[2,0,2,1],[3,0,3,1],[9,0,9,1],[10,0,10,1],[13,0,13,1],[159,0,159,1],[160,0,160,1],[76,0,76,1],[77,0,77,1],[108,0,108,1],[109,0,109,1],[92,0,92,1],[93,0,93,1],[104,0,104,1],[105,0,105,1],[88,0,88,1],[89,0,89,1],[31,0,31,1],[32,0,32,1],[35,0,35,1],[36,0,36,1],[58,0,58,1],[54,0,54,1],[55,0,55,1]]}
[null,null,null,"Support Need","2:1 Review?","Documentation Needed","Selection\nValue","En/Dis-able\nOther","Disabled\nBy","Group #","Group","Name","Current\nState","Mismatch\nTrace"]
[null,"Rating selections must be applied in accordance with the “ANA/CNA Manual version 3”, available at http://www.dhs.state.or.us/spd/tools/dd/cm/"]
["COMMUNICATION - EXPRESSIVE"]
[{"$f":"IF(INDEX('Raw Scoring'!R1:R18,MAX(J4:J10)+1)=\"Yes\",\"2:1 Review\",\"\")","v":""}]
[null,"This section assesses the child's ability to verbally, or through adaptive means, understandably express to others their needs in their home or community.\nChoose the option that most accurately reflects the supports required by the individual.\nCheck an option only if the support needed is due to the child's \ndisability.\n"]
[]
{"$rows_left_out":155}
{"sheet":"Nursing Assessment Indicators","index":3,"n_rows":0,"n_cols":0,"rows_kept":0,"cut":false,"hidden":false,"merged":[]}

{"sheet":"Nighttime Needs","index":4,"n_rows":15,"n_cols":14,"rows_kept":15,"cut":false,"hidden":false,"merged":[[2,0,2,1],[3,0,3,1],[14,0,14,1],[15,0,15,1]]}
[null,null,null,"Support Need","2:1 Review?","Documentation Needed","Selection\nValue","En/Dis-able\nOther","Disabled\nBy","Group #","Group","Name","Current\nState","Mismatch\nTrace"]
[null,"Rating selections must be applied in accordance with the “ANA/CNA Manual version 3”, available at http://www.dhs.state.or.us/spd/tools/dd/cm/"]
["NIGHTTIME NEEDS "]
[{"$f":"IF(INDEX('Raw Scoring'!K1:K3,MAX(J4:J10)+1)=\"Yes\",\"2:1 Review\",\"\")","v":""}]
[null,"This section assesses the child's need for disability related supports and monitoring during nighttime hours.\nChoose the option that most accurately reflects the supports required by the child due to the child's disability.\n"]
[]
{"$rows_left_out":10}
{"sheet":"Social and Behavioral Needs","index":5,"n_rows":69,"n_cols":14,"rows_kept":69,"cut":false,"hidden":false,"merged":[[54,0,54,1],[24,0,24,1],[25,0,25,1],[2,0,2,1],[11,0,11,1],[12,0,12,1],[15,0,15,1],[4,0,4,1],[17,0,17,1],[28,0,28,1],[30,0,30,1],[43,0,43,1],[37,0,37,1],[38,0,38,1],[41,0,41,1],[69,0,69,1],[55,0,55,1],[58,0,58,1],[68,0,68,1],[60,0,60,1]]}
[null,null,null,"Support Need","No","Documentation Needed","Selection\nValue","En/Dis-able\nOther","Disabled\nBy","Group #","Group","Name","Current\nState","Mismatch\nTrace"]
[null,"Rating selections must be applied in accordance with the “ANA/CNA Manual version 3”, available at http://www.dhs.state.or.us/spd/tools/dd/cm/"]
["BEHAVIORAL SUPPORTS - NO FORMAL PLAN - SUPERVISON AND MONITORING"]
[null,"Supervision and monitoring for behavior and mental health"]
[{"$f":"IF(INDEX('Raw Scoring'!Y1:Y6,MAX(J5:J11)+1)=\"Yes\",\"2:1 Review\",\"\")","v":""}]
[null,"This section assesses the child's ability to function in a home and community environment with behavioral supports from another person to maintain safety of self and/or others.  \nThese behaviors do not require a formal behavior support plan and are not addressed in a formal BSP.\nChoose the option that most accurately reflects the behavior supports required by the child.  Do not record supervision needed to address non-behavioral safety or health issues.  Check an option only if supports are needed due to the child's disability."]
{"$rows_left_out":64}
{"sheet":"Enhanced or Exceptional","index":6,"n_rows":42,"n_cols":14,"rows_kept":42,"cut":false,"hidden":false,"merged":[[31,0,31,1],[42,0,42,1]]}
[null,null,null,"Support Need","2:1 Review?","Documentation Needed","Selection\nValue","En/Dis-able\nOther","Disabled\nBy","Group #","Group","Name","Current\nState","Mismatch\nTrace"]
[null,"Rating selections must be applied in accordance with “Enhanced/Exceptional Insert to the ANA/CNA Manual version 3”, available at http://www.dhs.state.or.us/spd/tools/dd/cm/"]
["ENHANCED or EXCEPTIONAL NEEDS "]
[]
[]
[null,"Nursing Tasks:  check the box for all nursing tasks for which the individual requires physical assistance from a caregiver.  Do not include tasks that the individual completes independently and for which the individual requires only monitoring, reminders or cuing.  Do not include tasks which are performed in a clinical setting by professional staff or which are performed by home health nurse."]
{"$rows_left_out":37}
{"sheet":"Support Needs Summary","index":7,"n_rows":173,"n_cols":4,"rows_kept":173,"cut":false,"hidden":false,"merged":[]}
["SUPPORT NEEDS SUMMARY"]
[]
["ADLs","Support Needs Category"]
[null,{"$f":"ADLs!$A3","v":"AMBULATION / MOBILITY IN THE HOME AND COMMUNITY"}]
[null,"Support Need","2:1 Review?","Documentation Needed"]
[null,"Independent or Age Appropriate Supports Provided","No","None"]
{"$rows_left_out":168}
{"sheet":"Summary of In-Home Hours","index":8,"n_rows":32,"n_cols":6,"rows_kept":32,"cut":false,"hidden":false,"merged":[[23,0,24,0],[23,1,24,5],[21,4,21,5],[12,0,12,2],[9,4,12,5],[15,0,15,1],[11,0,11,2],[21,1,21,2],[20,0,20,5],[13,0,13,2],[17,0,18,2],[19,0,19,5],[13,3,13,4],[16,3,16,5],[0,0,0,5],[4,0,4,2],[1,4,1,5],[2,4,2,5],[1,1,1,2],[2,1,2,2],[3,3,4,3],[3,4,4,4],[3,5,4,5],[5,0,5,2],[3,0,3,2],[6,0,6,2],[7,0,7,2],[10,0,10,2],[8,0,8,2],[9,0,9,2]]}
["In Home Needs Summary - Children"]
["Name of Individual ",{"$f":"IF(ClientName=0,\"\",ClientName)","v":""},null,"Date of Birth ",{"$f":"IF(ClientDOB=0,\"\",ClientDOB)","v":""}]
["Date of Assessment ",{"$f":"IF(AssessmentDate=0,\"\",AssessmentDate)","v":""},null,"Age ",{"$f":"ClientAge","v":""}]
[null,null,null,"Assessed Hours\nPer Day","2:1 Review Required?",{"$f":"IF(AND(ISBLANK('2-1 Review and Approval'!$A$23),ISBLANK('2-1 Review and Approval'!$F$23)),\"\",\"Approved Monthly 2:1 Hours\")","v":""}]
[]
["ADL/IADL Hourly Supports",null,null,{"$f":"IF(ServiceSetting=CNA_GroupHome,\"N/A (SE 50 or 141)\",IF(ServiceElement=SE_FosterCare,\"N/A (SE 58)\",'Raw Scoring'!$L11))","v":0},{"$f":"IF(NOT(ISNUMBER($D$6)),\"N/A\",ADLs2to1Rev)","v":"No"},{"$f":"IF(OR(E6=\"No\",E6=\"N/A\"),\" \",IF(AND(ISBLANK('2-1 Review and Approval'!$A$23),ISBLANK('2-1 Review and Approval'!$F$23)),\"Approval Required\",IF(SUM('2-1 Review and Approval'!L6:L8)>0,SUM('2-1 Review and Approval'!L6:L8),0)))","v":" "}]
{"$rows_left_out":27}
{"sheet":"2-1 Review and Approval","index":9,"n_rows":25,"n_cols":12,"rows_kept":25,"cut":false,"hidden":false,"merged":[[12,1,12,2],[1,0,1,1],[1,5,1,6],[3,0,3,3],[1,2,1,3],[3,6,3,10],[22,5,22,7],[22,8,22,10],[20,5,20,10],[14,5,14,10],[15,5,15,10],[17,5,17,10],[18,5,18,10],[24,0,24,3],[14,0,14,3],[15,0,15,3],[17,0,17,3],[18,0,18,3],[22,0,22,1],[22,2,22,3],[20,0,20,3]]}
[]
["Review and Approval of 2 Person Supports",null,{"$f":"IF(ISBLANK('Client Demographics'!D3),\"\",'Client Demographics'!D3&\" - \"&'Client Demographics'!D4)","v":""},null,null,"DHS Review - 2:1 Exception",null,null,null,"Date of Review/Determination: "]
[]
["1.  Determine the amount of 2 person hours that are necessary to safely provide the support.",null,null,null,null,"ODDS Review Team: "]
[null,"Maximum Monthly \n2:1 Hours*","\nMonthly 2:1 Hours\nNeeded",null,null,null,"\nMonthly 2:1 Hours\nApproved"]
["Mobility",{"$f":"IF(NOT(ISNUMBER('Summary of In-Home Hours'!$D$6)),0,IF('Raw Scoring'!D2=\"Yes\", 30, 0))","v":0},0,null,null,"Mobility",null,null,null,null,null,{"$f":"IF(G6<>0,G6,IF(ISBLANK(C6),0,MIN(B6,C6)))","v":0}]
{"$rows_left_out":20}
{"sheet":"Raw Scoring","index":10,"n_rows":67,"n_cols":37,"rows_kept":67,"cut":false,"hidden":true,"merged":[[20,8,20,10],[18,9,18,11],[19,9,19,11],[10,8,10,10],[17,8,17,10],[16,8,16,10],[15,8,15,10],[14,8,14,10],[13,8,13,10],[12,8,12,10],[11,8,11,10]]}
["ADL\nGroup ID","Selection\nValue","Adjusted\nValue","2:1 Review","New\nScoring\nRow","New\nScoring\nColumn*","Hours","Nighttime\nGroup ID","Selection\nValue","Adjusted\nValue","2:1 Review","New\nScoring\nRow","New\nScoring\nColumn","Hours","Medical\nGroup ID","Selection\nValue","Adjusted\nValue","2:1 Review","New\nScoring\nRow","New\nScoring\nColumn","Hours","Behavior\nGroup ID","Selection\nValue","Adjusted\nValue","2:1 Review","New\nScoring\nRow","New\nScoring\nColumn*","Hours",null,"EE_Nursing\nGroup ID","Selection\nValue",null,"EE_Behav\nGroup ID","Selection\nValue"]
["ADL1",0,{"$f":"B2","v":0},"No",{"$f":"MATCH(A2,'New Scoring'!$A:$A,0)+C2","v":3},{"$f":"IF(EffectiveAge<5,COLUMN(NS_Age5),IF(EffectiveAge<12,COLUMN(NS_Age6to9),Default_NS_AgeCol))+IF(D2=\"Yes\",Unreduced_NS_Offset,0)","v":3},{"$f":"IF(EffectiveAge<4,0,OFFSET(NS_Values,E2-1,F2-1,1,1))","v":0},"Nighttime1",0,{"$f":"I2","v":0},"No",{"$f":"MATCH(H2,'New Scoring'!$A:$A,0)+J2","v":75},{"$f":"Default_NS_AgeCol+IF(K2=\"Yes\",Unreduced_NS_Offset,0)","v":3},{"$f":"IF(EffectiveAge=0,0,OFFSET(NS_Values,L2-1,M2-1,1,1))","v":0},"Medical1",0,{"$f":"P2","v":0},"N/A",{"$f":"MATCH(O2,'New Scoring'!$A:$A,0)+Q2","v":81},{"$f":"Default_NS_AgeCol+IF(R2=\"Yes\",Unreduced_NS_Offset,0)","v":3},{"$f":"IF(EffectiveAge=0,0,OFFSET(NS_Values,S2-1,T2-1,1,1))","v":0},"Behavior1",0,{"$f":"IF($W$4>1,0,W2)","v":0},"N/A",{"$f":"MATCH(V2,'New Scoring'!$A:$A,0)+X2","v":183},{"$f":"IF(EffectiveAge<5,COLUMN(NS_Age5),IF(EffectiveAge<12,COLUMN(NS_Age6to9),Default_NS_AgeCol))+IF(Y2=\"Yes\",Unreduced_NS_Offset,0)","v":3},{"$f":"IF(EffectiveAge<3.5,0,OFFSET(NS_Values,Z2-1,AA2-1,1,1))","v":0},null,"Ventilator1",0,null,"SupPlanImpl1",0,null,"EE_MedIsEnh:",{"$f":"IF(EE_NursingComplete,IF(EE_NursingEnh,$AK$9,$AK$11),IF(MedShEnh,$AK$12,$AK$11))","v":"N/A"}]
["ADL2",0,0,"No",{"$f":"MATCH(A3,'New Scoring'!$A:$A,0)+C3","v":9},{"$f":"IF(EffectiveAge<5,COLUMN(NS_Age5),IF(EffectiveAge<12,COLUMN(NS_Age6to9),Default_NS_AgeCol))+IF(D3=\"Yes\",Unreduced_NS_Offset,0)","v":3},{"$f":"IF(EffectiveAge<4,0,OFFSET(NS_Values,E3-1,F3-1,1,1))","v":0},"Totals",{"$f":"SUM(I2:I2)","v":0},{"$f":"SUM(J2:J2)","v":0},{"$f":"IF(COUNTIF(K1:K2,\"Yes\"),\"Yes\",\"No\")","v":"No"},null,null,{"$f":"SUM(N2:N2)","v":0},"Medical2",0,{"$f":"P3","v":0},"N/A",{"$f":"MATCH(O3,'New Scoring'!$A:$A,0)+Q3","v":87},3,0,"Behavior2",0,{"$f":"W3","v":0},"N/A",{"$f":"MATCH(V3,'New Scoring'!$A:$A,0)+X3","v":189},{"$f":"IF(EffectiveAge<5,COLUMN(NS_Age5),IF(EffectiveAge<12,COLUMN(NS_Age6to9),Default_NS_AgeCol))+IF(Y3=\"Yes\",Unreduced_NS_Offset,0)","v":3},{"$f":"IF(EffectiveAge=0,0,OFFSET(NS_Values,Z3-1,AA3-1,1,1))","v":0},null,"CPAP2",0,null,"SupPlanRevised2",0,null,"EE_MedIsExc:",{"$f":"IF(EE_NursingComplete,IF(EE_NursingExc,$AK$10,$AK$11),IF(OR(MedShEnh,MedShExc),$AK$12,$AK$11))","v":"N/A"}]
["ADL3",0,0,"N/A",{"$f":"MATCH(A4,'New Scoring'!$A:$A,0)+C4","v":15},{"$f":"Default_NS_AgeCol+IF(D4=\"Yes\",Unreduced_NS_Offset,0)","v":3},{"$f":"IF(EffectiveAge<15,0,IF(EffectiveAge<4,0,OFFSET(NS_Values,E4-1,F4-1,1,1)))","v":0},null,null,null,null,null,null,null,"Medical3",0,0,"N/A",{"$f":"MATCH(O4,'New Scoring'!$A:$A,0)+Q4","v":93},3,0,"Behavior3",0,0,"N/A",{"$f":"MATCH(V4,'New Scoring'!$A:$A,0)+X4","v":195},{"$f":"IF(EffectiveAge<5,COLUMN(NS_Age5),IF(EffectiveAge<12,COLUMN(NS_Age6to9),Default_NS_AgeCol))+IF(Y4=\"Yes\",Unreduced_NS_Offset,0)","v":3},{"$f":"IF(EffectiveAge=0,0,OFFSET(NS_Values,Z4-1,AA4-1,1,1))","v":0},null,"Oxygen3",0,null,"CmplxTools3",0,null,"EE_MedIsEnhExc:",{"$f":"IF(EE_MedIsExc<>$AK$11,EE_MedIsExc,EE_MedIsEnh)","v":"N/A"}]
["ADL4",0,0,"N/A",{"$f":"MATCH(A5,'New Scoring'!$A:$A,0)+C5","v":21},{"$f":"IF(EffectiveAge<5,COLUMN(NS_Age5),IF(EffectiveAge<12,COLUMN(NS_Age6to9),Default_NS_AgeCol))+IF(D5=\"Yes\",Unreduced_NS_Offset,0)","v":3},{"$f":"IF(EffectiveAge<3,0,OFFSET(NS_Values,E5-1,F5-1,1,1))","v":0},null,null,null,null,null,null,null,"Medical4",0,0,"N/A",{"$f":"MATCH(O5,'New Scoring'!$A:$A,0)+Q5","v":99},3,0,"Behavior4",0,0,"No",{"$f":"MATCH(V5,'New Scoring'!$A:$A,0)+X5","v":201},{"$f":"IF(EffectiveAge<5,COLUMN(NS_Age5),IF(EffectiveAge<12,COLUMN(NS_Age6to9),Default_NS_AgeCol))+IF(Y5=\"Yes\",Unreduced_NS_Offset,0)","v":3},{"$f":"IF(EffectiveAge=0,0,OFFSET(NS_Values,Z5-1,AA5-1,1,1))","v":0},null,"Resp4",0,null,"PPI4",0,null,"EE_BehavIsEnh:",{"$f":"IF(EE_BehavComplete,IF(EE_BehavEnh,$AK$9,$AK$11),IF(BehavShEnh,$AK$12,$AK$11))","v":"N/A"}]
["ADL5",0,0,"N/A",{"$f":"MATCH(A6,'New Scoring'!$A:$A,0)+C6","v":27},3,{"$f":"IF(EffectiveAge<4,0,OFFSET(NS_Values,E6-1,F6-1,1,1))","v":0},null,null,null,null,null,null,null,"Medical5",0,0,"N/A",{"$f":"MATCH(O6,'New Scoring'!$A:$A,0)+Q6","v":105},3,0,"Behavior5",0,0,"No",{"$f":"MATCH(V6,'New Scoring'!$A:$A,0)+X6","v":209},{"$f":"IF(EffectiveAge<5,COLUMN(NS_Age5),IF(EffectiveAge<12,COLUMN(NS_Age6to9),Default_NS_AgeCol))+IF(Y6=\"Yes\",Unreduced_NS_Offset,0)","v":3},{"$f":"IF(EffectiveAge=0,0,OFFSET(NS_Values,Z6-1,AA6-1,1,1))","v":0},null,"Trach5",0,null,"TwentyHrs5",0,null,"EE_BehavIsExc:",{"$f":"IF(EE_BehavComplete,IF(EE_BehavExc,$AK$10,$AK$11),IF(OR(BehavShEnh,BehavShExc),$AK$12,$AK$11))","v":"N/A"}]
{"$rows_left_out":62}
{"sheet":"New Scoring","index":11,"n_rows":214,"n_cols":32,"rows_kept":214,"cut":false,"hidden":true,"merged":[[0,24,0,26],[0,2,0,10],[0,14,0,22],[2,12,3,12]]}
["Pre-Reduction:",0,"CNA - BREAKPOINTS WITH OVERRIDE",null,null,null,null,null,null,null,null,{"$f":"IF(OR(ServiceElement=SE51SelectionStr,MinLT14HrRdcnOvrrd),0,$B$1)","v":0},"<< SE51 doesn't apply to",null,"CNA - NEW BREAKPOINTS (Same scores)",null,null,null,null,null,null,null,null,null,"CNA - OLD BREAKPOINTS"]
["Category","Selection\nValue","0-2",3,4,5,"6-9","10-11","12-14","15-17","18+","Topic","CNA but is included for consistency.",null,"0-2",3,4,5,"6-9","10-11","12-14","15-17","18+",null,"Hours for\nAges 0 to 5","Hours for\nAges 6 to 9","Hours for\nAges > 9",null,"Last updated",null,"Score\nRange Names","Unreduced\nRange Names"]
["ADL1",0,{"$f":"O3-(O3*$L$1)","v":0},{"$f":"P3-(P3*$L$1)","v":0},{"$f":"Q3-(Q3*$L$1)","v":0},{"$f":"R3-(R3*$L$1)","v":0},{"$f":"S3-(S3*$L$1)","v":0},{"$f":"T3-(T3*$L$1)","v":0},{"$f":"U3-(U3*$L$1)","v":0},{"$f":"V3-(V3*$L$1)","v":0},{"$f":"W3-(W3*$L$1)","v":0},"Ambulation/Mobility","NOTE: Blue font items are formulas!",null,0,0,0,0,0,0,0,0,0,null,0,0,0,null,null,null,"NS_Age0to2","UR_Age0to2"]
["ADL1",1,0.1,0.1,0.1,0.1,0.5,0.5,0.5,0.5,0,null,null,null,0.1,0.1,0.1,0.1,0.5,0.5,0.5,0.5,0,null,0.1,0.5,0.5,null,null,null,"NS_Age3","UR_Age3"]
["ADL1",2,0.1,0.1,0.1,0.1,0.5,0.5,0.5,0.5,0,null,"Not an avaiable score",null,0.1,0.1,0.1,0.1,0.5,0.5,0.5,0.5,0,null,0.1,0.5,0.5,null,null,null,"NS_Age4","UR_Age4"]
["ADL1",3,0.1,0.1,0.1,0.1,0.5,0.5,0.5,0.5,0,null,"Not an avaiable score",null,0.1,0.1,0.1,0.1,0.5,0.5,0.5,0.5,0,null,0.1,0.5,0.5,null,null,null,"NS_Age5","UR_Age5"]
{"$rows_left_out":209}
{"sheet":"Control","index":12,"n_rows":56,"n_cols":30,"rows_kept":56,"cut":false,"hidden":true,"merged":[]}
[null,"Before-Save\nActive Sheet",null,"County/Brokerage LookUp",null,"Relationships",null,"Support Need Options - ADL (CNA)","Support Need Options - Medical  (CNA)","Support Need Options - Nighttime","Support Need Options - Behavior","Documentation Needed Options","Documentation Needed Options - Behavior",null,"This\nTool-Type","Tool-Type\nIndex",null,"ANA\nService Settings","ANA\nSE Mapping","CNA\nService Settings","CNA\nSE Mapping",null,"SE No Options","ANA\nSE Non-Group Home","CNA\nSE Non-Group Home","CNA\nSE C-W Foster Care","SE Foster Care","ANA\nSE Group Home","CNA\nSE Group Home","SE Other"]
[null,"Client Demographics",null,"(Select)",null,"(Select)",null,"Independent or Age Appropriate Supports Provided","Independent","Independent","Not Applicable or Age-Appropriate Supervision","None","None",null,{"$f":"LEFT(TRIM(VersionDisplay), FIND(\" \",TRIM(VersionDisplay)) - 1)","v":"CNA"},{"$f":"IF(O2=\"ANA\",0,IF(O2=\"CNA\",1,\"#VALUE!\"))","v":1},null,"(Select)","SE_NoOptions","(Select)","SE_NoOptions",null,"(Select)","(Select)","(Select)","(Select)","Foster Care (SE 58)","24hr Residential (SE 50)","24hr Residential (SE 50)","(Explain in comment field of \"Summary of In-Home Hours\" sheet)"]
[null,null,null,"Community Pathways",null,"Self",null,"Partial Assist","Independent or Age Appropriate Supports Provided","Nighttime Assist - monthly","Independent or Age Appropriate Supports Provided","Caregivers' schedule and duties","OIS Training",null,null,null,null,"Family Home","SE_NonGroupHome_ANA","Family Home","SE_NonGroupHome_CNA",null,null,"Comp In-Home (SE 49)","Child Long-term Support (SE 151)","Child Long-term Support (SE 151)",null,"SACU (SE 141)","Child Residential (SE 142)"]
[null,"Keep Current File Name",null,"CSI",null,"Legal Guardian",null,"Partial Assist - assistance","Individual-Directed Care","Nighttime Assist - weekly","Within Hearing or Visual Distance","Not Applicable","Functional Assessment and Formal Behavior Support Plan",null,null,null,null,"Own Home","SE_NonGroupHome_ANA","Child-welfare Foster","SE_CW_FosterCare",null,null,"Brokerage In-Home (SE 149)","CIIS (SE 145)","CIIS (SE 145)",null,null,"SACU (SE 141)"]
[null,true,null,"EOSSB",null,"Parent",null,"Partial Assist - cueing","Partial Assist","Nighttime Assist - intermittent nightly","Within Hearing and Visual Distance",null,"Functional Assessment and Formal Behavior Support Plan, OIS Training",null,null,null,null,"Foster Care","SE_FosterCare","DD Foster","SE_FosterCare",null,null,"Supported Living (SE 51)",null,"Foster Care (SE 58)","^ NOTE: Shaded cell's named-range SE_FosterCare is also referenced by CNA's \"Summary of In-Home Hours\" sheet formula"]
[null,null,null,"Full Access",null,"Provider/Staff",null,"Partial Assist - food cut up","Partial Assist - 1 to 3 per day","Nighttime Assist - ongoing nightly","Redirecting",null,"Functional Assessment and Formal Behavior Support Plan if indicated by the FA",null,null,null,null,"24-hr. Group Home","SE_GroupHome_ANA","24-hr. Group Home","SE_GroupHome_CNA",null,null,"* BEWARE: Shaded cell is referenced by the \"New Scoring\" sheet",null,"* Shaded cell is same CNA value as SE_FosterCare so SE_FosterCare is referenced, for both cases, by CNA's \"Summary of In-Home Hours\" formula"]
{"$rows_left_out":50}